﻿Name,Ab or Nb,Binds to,Doesn't Bind to,Neutralising Vs,Not Neutralising Vs,Protein + Epitope,Origin,VHorVHH,VL,Heavy V Gene,Heavy J Gene,Light V Gene,Light J Gene,CDRH3,CDRL3,Structures,ABB Homology Model (if no structure),Sources,Date Added,Last Updated,Update Description,Notes/Following Up?
Curtis_3548_S-2,Ab,SARS-CoV2_WT;SARS-CoV2_Beta,SARS-CoV2_Omicron-BA1;HKU1,SARS-CoV2_WT (weak),,S; RBD/non-RBD,B-cells; SARS-CoV2 Human Patient,ND,ND,IGHV4-31 (Human),IGHJ4 (Human),ND,ND,ARGSRNDLRDFDY,QSYNSSLSGLVV,ND,,"Nicholas Curtis et al., 2023 (https://www.biorxiv.org/content/10.1101/2023.09.08.556349v1)","Feb 8, 2024","Feb 8, 2024",,Complete
Curtis_3548_S-7,Ab,SARS-CoV2_WT;SARS-CoV2_Beta,SARS-CoV2_Omicron-BA1;HKU1,,SARS-CoV2_WT,S; non-RBD,B-cells; SARS-CoV2 Human Patient,ND,ND,IGHV4-34 (Human),IGHJ4 (Human),ND,ND,AREPYSSGMGGRDY,QQYGSSPYT,ND,,"Nicholas Curtis et al., 2023 (https://www.biorxiv.org/content/10.1101/2023.09.08.556349v1)","Feb 8, 2024","Feb 8, 2024",,Complete
Curtis_3548_RBD-15,Ab,SARS-CoV2_WT,SARS-CoV2_Beta;SARS-CoV2_Omicron-BA1;HKU1,,SARS-CoV2_WT,S; iso-RBD,B-cells; SARS-CoV2 Human Patient,ND,ND,IGHV4-59 (Human),IGHJ5 (Human),ND,ND,AKGIYSSSSYWFGP,QAWDSSTVV,ND,,"Nicholas Curtis et al., 2023 (https://www.biorxiv.org/content/10.1101/2023.09.08.556349v1)","Feb 8, 2024","Feb 8, 2024",,Binds only non-prefusion stabilised RBD. Complete
8-D9,Ab,SARS-CoV2_WT;SARS-CoV2_Alpha;SARS-CoV2_Beta;SARS-CoV2_Gamma;SARS-CoV2_Delta;SARS-CoV2_Epsilon;SARS-CoV2_Zeta;SARS-CoV2_Eta;SARS-CoV2_Iota;SARS-CoV2_Kappa;SARS-CoV2_Lambda;SARS-CoV2_Mu;SARS-CoV2_Omicron-BA1;SARS-CoV2_Omicron-BA2;SARS-CoV2_Omicron-BA2.12.1;SARS-CoV2_Omicron-BA3;SARS-CoV2_Omicron-BA4;SARS-CoV2_Omicron-BA5;SARS-CoV2_Omicron-XD;SARS-CoV2_Omicron-BA4.6;SARS-CoV2_Omicron-BF7,,SARS-CoV2_WT;SARS-CoV2_Alpha;SARS-CoV2_Beta;SARS-CoV2_Gamma;SARS-CoV2_Delta;SARS-CoV2_Epsilon;SARS-CoV2_Zeta;SARS-CoV2_Eta;SARS-CoV2_Iota;SARS-CoV2_Kappa;SARS-CoV2_Lambda;SARS-CoV2_Mu;SARS-CoV2_Omicron-BA1 (weak);SARS-CoV2_Omicron-BA2 (weak);SARS-CoV2_Omicron-BA2.12.1;SARS-CoV2_Omicron-BA3;SARS-CoV2_Omicron-BA4;SARS-CoV2_Omicron-BA5;SARS-CoV2_Omicron-XD;SARS-CoV2_Omicron-BA4.6;SARS-CoV2_Omicron-BF7,,S; RBD,B-cells; SARS-CoV2 Human Vaccinee (BBIBP-CorV),VQLVESGGGLVQPGGSLRLSCAASGLTVSSNYMNWVRQAPGKGLEWVSVFYPGGSTFYADSVRGRFTISRDNSKNTLYLQMNSLRAEDTAVYYCARDHSGHALDIWGQGTMVTVS,DIQMTQSPSFLSASVGDRVTITCRASQGISSYLAWYQQKPGKAPKLLIYAASTLQSGVPSRFSGSGSGTEFTLTISSLQPEDFATYYCQHLNSYPSMYTFGQGTKVDI,IGHV3-66 (Human),IGHJ3 (Human),IGKV1-9 (Human),IGKJ3 (Human),ARDHSGHALDI,QHLNSYPSMYT,https://www.rcsb.org/structure/8J1T;https://www.rcsb.org/structure/8J1V,,"Wanbo Tai et al., 2023 (https://www.nature.com/articles/s41467-023-43798-8)","Feb 8, 2024","Feb 8, 2024",,Complete
Sun_1G11,Ab,SARS-CoV2_WT;SARS-CoV2_Alpha;SARS-CoV2_Beta;SARS-CoV2_Gamma;SARS-CoV2_Delta;SARS-CoV2_Omicron-BA1;SARS-CoV2_Omicron-BA1.1;SARS-CoV2_Omicron-BA2;SARS-CoV2_Omicron-BA2.12.1;SARS-CoV2_Omicron-BA2.75;SARS-CoV2_Omicron-BA4/5;SARS-CoV2_Omicron-BF7,,SARS-CoV2_WT;SARS-CoV2_Alpha;SARS-CoV2_Beta;SARS-CoV2_Gamma;SARS-CoV2_Delta;SARS-CoV2_Omicron-BA1;SARS-CoV2_Omicron-BA1.1;SARS-CoV2_Omicron-BA2;SARS-CoV2_Omicron-BA2.12.1;SARS-CoV2_Omicron-BA2.75;SARS-CoV2_Omicron-BA4/5;SARS-CoV2_Omicron-BF7,SARS-CoV2_Omicron-BQ1;SARS-CoV2_Omicron-BQ1.1;SARS-CoV2_Omicron-XBB,S; RBD,B-cells; SARS-CoV2 Human Patient,EVQLVESGGGLVQPGRSLRLSCAASGFKFDDYAMHWVRQAPGKGLEWVSGTSWNSGTTGYADSVRGRFTISRDNAKKSLYLQMNSLGVEDTAFYYCVKDSNYDSSGYLINNFDYWGQGILVTVSS,DIQLTQSPSFLSASVGDRVTITCRASQGIDKYLAWYQQKPGQAPKVLIYAASTLHSGVPSRFSGSGSGTDFTLTISSLQPEDFATYYCQQLYTFPVTFGPGTKVDVR,IGHV3-9 (Human),IGHJ4 (Human),IGKV1-9 (Human),IGKJ3 (Human),VKDSNYDSSGYLINNFDY,QQLYTFPVT,https://www.rcsb.org/structure/8IX3,,"Hui Sun et al., 2023 (https://journals.asm.org/doi/10.1128/jvi.01137-23)","Feb 8, 2024","Feb 8, 2024",,Complete
8F4P,Nb,SARS-CoV2_WT,,,,S; S1,TBC,EVQLVESGGGLVQPGGSLRLSCAASGGTFSSIGMGWFRQAPGKEREFVAAISWDGGATAYADSVKGRFTISADNSKNTAYLQMNSLKPEDTAVYYCAKEDVGKPFDWGQGTLVTVSS,,IGHV3-3 (Alpaca),IGHJ3 (Alpaca),,,AKEDVGKPFD,,https://www.rcsb.org/structure/8F4P,,PDB (to be published),"Feb 8, 2024","Feb 8, 2024",,Read publication when released for metadata.
NIV-1,Ab,SARS-CoV2_WT;SARS-CoV2_Delta;SARS-CoV2_Omicron-BA1,,SARS-CoV2_WT;SARS-CoV2_Delta;SARS-CoV2_Omicron-BA1,,S; RBD,Computational engineering from another binder,ND,ND,IGHV4-34 (Human),IGHJ4 (Human),IGLV2-14 (Human),IGLJ1 (Human),ARGLYSGYDLAY,SSYTSSNTYV,ND,,"Saya Moriyama et al., 2023 (https://www.nature.com/articles/s41467-023-39890-8)","Feb 8, 2024","Feb 8, 2024",,Complete
NIV-5,Ab,SARS-CoV2_WT;SARS-CoV2_Delta;SARS-CoV2_Omicron-BA1;SARS-CoV2_Omicron-BA2,,SARS-CoV2_WT;SARS-CoV2_Delta;SARS-CoV2_Omicron-BA1;SARS-CoV2_Omicron-BA2,,S; RBD,Computational engineering from another binder,ND,ND,IGHV5-51 (Human),IGHJ4 (Human),IGKV3-15 (Human),IGKJ5 (Human),TRGGILCNGASCAADF,QQYNNWPYT,ND,,"Saya Moriyama et al., 2023 (https://www.nature.com/articles/s41467-023-39890-8)","Feb 8, 2024","Feb 8, 2024",,Complete
NIV-6,Ab,SARS-CoV2_WT;SARS-CoV2_Delta;SARS-CoV2_Omicron-BA1;SARS-CoV2_Omicron-BA2,,SARS-CoV2_WT;SARS-CoV2_Delta;SARS-CoV2_Omicron-BA1;SARS-CoV2_Omicron-BA2,,S; RBD,Computational engineering from another binder,ND,ND,IGHV4-39 (Human),IGHJ4 (Human),IGLV10-54 (Human),IGLJ3 (Human),TRLGGRGFTPEFDY,SAWDITLSAWV,ND,,"Saya Moriyama et al., 2023 (https://www.nature.com/articles/s41467-023-39890-8)","Feb 8, 2024","Feb 8, 2024",,Complete
NIV-8,Ab,SARS-CoV2_WT;SARS-CoV2_Delta;SARS-CoV2_Omicron-BA1;SARS-CoV2_Omicron-BA2,,SARS-CoV2_WT;SARS-CoV2_Delta;SARS-CoV2_Omicron-BA1;SARS-CoV2_Omicron-BA2,,S; RBD,Computational engineering from another binder,ND,ND,IGHV3-30 (Human),IGHJ4 (Human),IGLV1-40 (Human),IGLJ3 (Human),ARDGPDTSGYYANIYFDF,QSYDNSLILAV,https://www.rcsb.org/structure/7YH6;https://www.rcsb.org/structure/7YH7,,"Saya Moriyama et al., 2023 (https://www.nature.com/articles/s41467-023-39890-8)","Feb 8, 2024","Feb 8, 2024",,Complete
NIV-9,Ab,SARS-CoV2_WT;SARS-CoV2_Delta;SARS-CoV2_Omicron-BA1;SARS-CoV2_Omicron-BA2,,SARS-CoV2_WT;SARS-CoV2_Delta;SARS-CoV2_Omicron-BA1;SARS-CoV2_Omicron-BA2,,S; RBD,Computational engineering from another binder,ND,ND,IGHV3-49 (Human),IGHJ4 (Human),IGLV1-44 (Human),IGLJ2 (Human),TRALPYVSGDY,ATWDDSLNGPA,ND,,"Saya Moriyama et al., 2023 (https://www.nature.com/articles/s41467-023-39890-8)","Feb 8, 2024","Feb 8, 2024",,Complete
NIV-10,Ab,SARS-CoV2_WT;SARS-CoV2_Delta;SARS-CoV2_Omicron-BA1;SARS-CoV2_Omicron-BA2,,SARS-CoV2_WT;SARS-CoV2_Delta;SARS-CoV2_Omicron-BA1;SARS-CoV2_Omicron-BA2,,S; RBD,Computational engineering from another binder,EVQLVESGGGLVQPGGSLRLSCAASGFTFYSYWMTWVRQAPGKGLEWVANIKHDESESHYVDSVRGRFTISRDNAKNSVYLQMKGLRAEDTAVYYCARDGGYNILTAYYHAPSYWGQGTLVTVSS,QSALTQPASVSGSPGQSITISCTGTSSDVGGYNFVSWYRQYPGKAPQLMIYDVSRRPSGDSDRFSGSKSGNTASLTISGLQAEDEAEYHCSSYTGRSPYVVFGGGTKVTVL,IGHV3-7 (Human),IGHJ4 (Human),IGLV2-14 (Human),IGLJ2 (Human),ARDGGYNILTAYYHAPSYW,SSYTGRSPYVV,https://www.rcsb.org/structure/8HES,,"Saya Moriyama et al., 2023 (https://www.nature.com/articles/s41467-023-39890-8)","Feb 8, 2024","Feb 8, 2024",,Complete
NIV-11,Ab,SARS-CoV2_WT;SARS-CoV2_Delta;SARS-CoV2_Omicron-BA1;SARS-CoV2_Omicron-BA2,,SARS-CoV2_WT;SARS-CoV2_Delta;SARS-CoV2_Omicron-BA1;SARS-CoV2_Omicron-BA2,,S; RBD,Computational engineering from another binder,QLVQSGPEVKKPGTSVKVSCKASGFTFYYSAVQWVRQARGQRLEWLGWMAVGSGKANYAQKFQERLTLTRDMSTSTAYMELSSLRSEDTAVYYCAAPNCTGGSCYDGFNLWGQGTVVTVSS,EIVLTQSPGTLSLSPGDRAILSCRASQTVNSNYLAWYQQKPGQAPRLLIYGTSSRATGIPDRFSGSGSGTDFTLTISRLEPEDFAVYYCQQYGSSPWLFGQGTKVEIK,IGHV1-58 (Human),IGHJ3 (Human),IGKV3-20 (Human),IGKJ1 (Human),AAPNCTGGSCYDGFNL,QQYGSSPWL,https://www.rcsb.org/structure/8HGL;https://www.rcsb.org/structure/8HGM,,"Saya Moriyama et al., 2023 (https://www.nature.com/articles/s41467-023-39890-8)","Feb 8, 2024","Feb 8, 2024",,Complete
NIV-12,Ab,SARS-CoV2_WT;SARS-CoV2_Delta;SARS-CoV2_Omicron-BA1,,SARS-CoV2_WT;SARS-CoV2_Delta;SARS-CoV2_Omicron-BA1,,S; RBD,Computational engineering from another binder,ND,ND,IGHV1-58 (Human),IGHJ3 (Human),IGKV3-20 (Human),IGKJ1 (Human),AAPFCSGGSCYDGFNI,QQYGSSPWT,ND,,"Saya Moriyama et al., 2023 (https://www.nature.com/articles/s41467-023-39890-8)","Feb 8, 2024","Feb 8, 2024",,Complete
NIV-13,Ab,SARS-CoV2_WT;SARS-CoV2_Delta;SARS-CoV2_Omicron-BA1;SARS-CoV2_Omicron-BA2,,SARS-CoV2_WT;SARS-CoV2_Delta;SARS-CoV2_Omicron-BA1;SARS-CoV2_Omicron-BA2,,S; RBD,Computational engineering from another binder,ND,ND,IGHV3-23 (Human),IGHJ3 (Human),IGLV3-25 (Human),IGLJ2 (Human),AKGDYYDSSGYLAEYFPH,QSTDISGVL,ND,,"Saya Moriyama et al., 2023 (https://www.nature.com/articles/s41467-023-39890-8)","Feb 8, 2024","Feb 8, 2024",,Complete
NIV-15,Ab,SARS-CoV2_WT;SARS-CoV2_Delta;SARS-CoV2_Omicron-BA1;SARS-CoV2_Omicron-BA2,,SARS-CoV2_WT;SARS-CoV2_Delta;SARS-CoV2_Omicron-BA1;SARS-CoV2_Omicron-BA2,,S; RBD,Computational engineering from another binder,ND,ND,IGHV2-5 (Human),IGHJ1 (Human),IGLV2-14 (Human),IGLJ2 (Human),AQHTISKIFDH,SSYTSGNLPLV,ND,,"Saya Moriyama et al., 2023 (https://www.nature.com/articles/s41467-023-39890-8)","Feb 8, 2024","Feb 8, 2024",,Complete
NIV-20,Ab,SARS-CoV2_WT;SARS-CoV2_Delta;SARS-CoV2_Omicron-BA1;SARS-CoV2_Omicron-BA2,,SARS-CoV2_WT;SARS-CoV2_Delta;SARS-CoV2_Omicron-BA1;SARS-CoV2_Omicron-BA2,,S; RBD,Computational engineering from another binder,ND,ND,IGHV3-53 (Human),IGHJ4 (Human),IGKV3-15 (Human),IGKJ2 (Human),ARDLGVVGGTDQ,QQYNNWPPGYT,ND,,"Saya Moriyama et al., 2023 (https://www.nature.com/articles/s41467-023-39890-8)","Feb 8, 2024","Feb 8, 2024",,Complete
NIV-22,Ab,SARS-CoV2_WT;SARS-CoV2_Delta;SARS-CoV2_Omicron-BA1;SARS-CoV2_Omicron-BA2,,SARS-CoV2_WT;SARS-CoV2_Delta;SARS-CoV2_Omicron-BA1;SARS-CoV2_Omicron-BA2,,S; RBD,Computational engineering from another binder,ND,ND,IGHV3-9 (Human),IGHJ5 (Human),IGLV2-8 (Human),IGLJ2 (Human),AKARFPGLAAAGYYGLDV,SSYAGSNNLV,ND,,"Saya Moriyama et al., 2023 (https://www.nature.com/articles/s41467-023-39890-8)","Feb 8, 2024","Feb 8, 2024",,Complete
NIV-29,Ab,SARS-CoV2_WT;SARS-CoV2_Delta;SARS-CoV2_Omicron-BA1;SARS-CoV2_Omicron-BA2,,SARS-CoV2_WT;SARS-CoV2_Delta;SARS-CoV2_Omicron-BA1;SARS-CoV2_Omicron-BA2,,S; RBD,Computational engineering from another binder,ND,ND,IGHV3-66 (Human),IGHJ6 (Human),IGKV3-15 (Human),IGKJ2 (Human),ARDLGPVGATDQ,QQYISWPPGYT,ND,,"Saya Moriyama et al., 2023 (https://www.nature.com/articles/s41467-023-39890-8)","Feb 8, 2024","Feb 8, 2024",,Complete
NIV-30,Ab,SARS-CoV2_WT;SARS-CoV2_Delta;SARS-CoV2_Omicron-BA1;SARS-CoV2_Omicron-BA2,,SARS-CoV2_WT;SARS-CoV2_Delta;SARS-CoV2_Omicron-BA1;SARS-CoV2_Omicron-BA2,,S; RBD,Computational engineering from another binder,ND,ND,IGHV1-69 (Human),IGHJ5 (Human),IGKV2-28 (Human),IGKJ1 (Human),ARVGGHWNDPFNYYGMDV,MQALQTPT,ND,,"Saya Moriyama et al., 2023 (https://www.nature.com/articles/s41467-023-39890-8)","Feb 8, 2024","Feb 8, 2024",,Complete
NIV-35,Ab,SARS-CoV2_WT;SARS-CoV2_Delta;SARS-CoV2_Omicron-BA1;SARS-CoV2_Omicron-BA2,,SARS-CoV2_WT;SARS-CoV2_Delta;SARS-CoV2_Omicron-BA1;SARS-CoV2_Omicron-BA2,,S; RBD,Computational engineering from another binder,ND,ND,IGHV1-58 (Human),IGHJ6 (Human),IGKV3-20 (Human),IGKJ1 (Human),AAPHCNRTNCYDGFDL,QQYGSSPWT,ND,,"Saya Moriyama et al., 2023 (https://www.nature.com/articles/s41467-023-39890-8)","Feb 8, 2024","Feb 8, 2024",,Complete
NIV-36,Ab,SARS-CoV2_WT;SARS-CoV2_Delta;SARS-CoV2_Omicron-BA1;SARS-CoV2_Omicron-BA2,,SARS-CoV2_WT;SARS-CoV2_Delta;SARS-CoV2_Omicron-BA1;SARS-CoV2_Omicron-BA2,,S; RBD,Computational engineering from another binder,ND,ND,IGHV3-53 (Human),IGHJ3 (Human),IGKV3-15 (Human),IGKJ2 (Human),ARDLGSVGGTDF,QQYISWPPGYT,ND,,"Saya Moriyama et al., 2023 (https://www.nature.com/articles/s41467-023-39890-8)","Feb 8, 2024","Feb 8, 2024",,Complete
P4J15,Ab,SARS-CoV2_Omicron-XBB1;SARS-CoV2_Omicron-XBB1.5;SARS-CoV2_Omicron-XBB2.3;SARS-CoV2_Omicron-EG5.1,,SARS-CoV2_Omicron-XBB1;SARS-CoV2_Omicron-XBB1.5;SARS-CoV2_Omicron-XBB2.3;SARS-CoV2_Omicron-EG5.1,,S; RBD,B-cells; SARS-CoV2 Human Patient,QVQIQQWGAGLLKPSETLSLTCAVYDESFSDYFWTWIRQSPGMGLEWIGEVTHTGSANYNPSLMSRVTMSRDTSKNQISLKLTSVTAADTAVYYCARDSPLGSIIKRGDYWGQGTLVTVSS,DIQMTQSPSSLSASVGDRVTVTCQASQGITNYVNWYQQKPGKAPKLLIYHASHLETGVPSRFSGSGSGTDFTFTISSLQPEDFATYYCQQFDHLPPTFGQGTRLEIK,IGHV4-34 (Human),IGHJ4 (Human),IGKV1-33 (Human),IGKJ5 (Human),ARDSPLGSIIKRGDY,QQFDHLPPT,https://www.rcsb.org/structure/8PQ2,,"Craig Fenwick et al., 2023 (https://www.journalofinfection.com/article/S0163-4453(23)00539-X/fulltext)","Feb 8, 2024","Feb 8, 2024",,Complete
Zhang_Nb,Nb,SARS-CoV2_WT,,,,S; RBD,TBC,QLQLVESGGGLVQAGGSLRLSCAASGGTFSRSGWFRQAPGKEREFVAAISRADVGFPNYADSVKGRFTISRDNAKNTVYLQMNSLKPEDTAVYYCAATSLQSGKYDYWGQGTQVTVS,,IGHV3-3 (Alpaca),IGHJ4 (Alpaca),,,AATSLQSGKYDY,,https://www.rcsb.org/structure/8H91,,PDB (to be published),"Feb 8, 2024","Feb 8, 2024",,Read publication when released for metadata.
Laughlin_Nb,Nb,SARS-CoV2_WT,,,,S; RBD,TBC,EVQLVESGGGLVQPGGSLRLSCAASGGTFSSIGMGWFRQAPGKEREFVAAISWDGGATAYADSVKGRFTISADNSKNTAYLQMNSLKPEDTAVYYCAKEDVGKPFDWGQGTLVTVSS,,IGHV3-3 (Alpaca),IGHJ3 (Alpaca),,,AKEDVGKPFD,,https://www.rcsb.org/structure/8EYG;https://www.rcsb.org/structure/8EYH,,PDB (to be published),"Feb 8, 2024","Feb 8, 2024",,Read publication when released for metadata.
pT1696,Ab,SARS-CoV2_WT,,,,S; RBD,TBC,QMQLEQSGPEVKKPGTSVKVSCKASGFTFSSAAVQWVRQARGQRLEWMGWIVVGSGNANYAQKFQERVTITRDMSTSIAYMELSSLRSEDTAVYYCAAPHCNRTSCLDGFDIWGQGTMVTVSS,EIVLTQSPGTLSLSPGERATLSCRASQSVSRNYLAWYQQKPGQAPRLLIYGASSRATGIPDRFSGSGSGTDFTLNISRLEPEDFAVYYCQQYGSSPWTFGQGTKVDIK,IGHV1-58 (Human),IGHJ3 (Human),IGKV3-20 (Human),IGKJ1 (Human),AAPHCNRTSCLDGFDI,QQYGSSPWT,https://www.rcsb.org/structure/8BG6,,PDB (to be published),"Feb 8, 2024","Feb 8, 2024",,Read publication when released for metadata.
pT1644,Ab,SARS-CoV2_WT,,,,S; RBD,TBC,EVQLVESGGGLVQPGGSLRLSCAASEITVSSNYMNWVRQAPGKGLEWVSVIYPGGTTYYAESVKGRFAISRDNSKNTLYLQMNSLRPEDTAVYYCARVMRHEIWGQGTLVTVSS,DIQMTQSQSSLSASVGDRVTITCQASQDINNFLNWYQQKPGKAPKLLIYDASHLETGVPSRFSGSGSGTNFTFTISSLQPEDIATYYCQHCDNPPYTFGQGTKLEIR,IGHV3-66 (Human),IGHJ1 (Human),IGKV1-33 (Human),IGKJ2 (Human),ARVMRHEI,QHCDNPPYT,https://www.rcsb.org/structure/8BG6,,PDB (to be published),"Feb 8, 2024","Feb 8, 2024",,Read publication when released for metadata.
pT1631,Ab,SARS-CoV2_WT,,,,S; RBD,TBC,EVQLVESGGGLIQPGGSLRLSCAASEIIVSSNYMSWVRQAPGKGLEWVSVLYPGGSTFYADSVKGRFTISRDNSRNTLYLHMKSPRAEDTAVYYCTRALWEGATFDYWGQGTLVTVSS,DIQLTQSPSFLSASVGDRITITCRASQGISSYLAWYQQKPGKAPKLLIYAASTLQSGVPSRFSGSGSGTEFTLTISSLQPEDFATYYCQHVNSFPGPYTFGQGTKLEIK,IGHV3-53 (Human),IGHJ4 (Human),IGKV1-9 (Human),IGKJ2 (Human),TRALWEGATFDY,QHVNSFPGPYT,https://www.rcsb.org/structure/8BG5,,PDB (to be published),"Feb 8, 2024","Feb 8, 2024",,Read publication when released for metadata.
pT1611,Ab,SARS-CoV2_WT,,,,S; RBD,TBC,EVQLVESGGGLIQPGGSLRLSCAASGVTVSRNYMSWVRQAPGKGLEWVSIIYAGGSTFYADSVKGRFTVSRDNSKNTLYLQMNSLRAEDTAVYYCVRDLQDYGMDVWGQGTTVTVSS,DMQLTQSPSFLSASVGDRVTITCRASQGISSYLAWYQQKPGKAPKLLIYAASTLQSGVPSRFSGRGSGTEFTLTISSLQPEDFATYYCQQLNSYPPGTFGQGTKVEIK,IGHV3-53 (Human),IGHJ6 (Human),IGKV1-9 (Human),IGKJ1 (Human),VRDLQDYGMDV,QQLNSYPPGT,https://www.rcsb.org/structure/8BG4,,PDB (to be published),"Feb 8, 2024","Feb 8, 2024",,Read publication when released for metadata.
pT1610,Ab,SARS-CoV2_WT,,,,S; RBD,TBC,EVRLVESGGGLIQPGGSLRLSCAASEITVSDNYMSWVRQAPGKGLEWVSVLYSGGSAFYADSVKGRFTISRDNSKNTLYLQMNSLRAEDTAVYYCARGDGWEPPFDFWGQGTLVTVSS,QSALTQPPSASGSPGQSVRISCTGTSSDVGGHNFVSWFQQHPGKAPKLMIYEVSKRPSGVPDRFSGSKSGNTASLTVSGLQAEDEADYYCSSYAGSNNLLFGGGTKLTVL,IGHV3-53 (Human),IGHJ5 (Human),IGLV2-8 (Human),IGLJ2 (Human),ARGDGWEPPFDF,SSYAGSNNLL,https://www.rcsb.org/structure/8BG3,,PDB (to be published),"Feb 8, 2024","Feb 8, 2024",,Read publication when released for metadata.
pT1580,Ab,SARS-CoV2_WT,,,,S; RBD,TBC,EVQLVESGGGLIQPGGSLRLSCAASGFIVSRNYMSWVRQAPGKGLEWVSGIYSGGSTFYADSVKGRFTISRDSSKNTLYLQMNSLRAEDTAVYYCAKDVPLGSHYFDYWGQGTLVTVSS,EIVLTQSPGTLSLSPGERVTLSCRASQSVSINYLAWYQQKPGQAPRLLIYGASSRATGISDRFSGSGSGTDFTLTISRLEPEDFAVYYCQQYDSSPLTFGGGTKVEIK,IGHV3-53 (Human),IGHJ4 (Human),IGKV3-20 (Human),IGKJ4 (Human),AKDVPLGSHYFDY,QQYDSSPLT,https://www.rcsb.org/structure/8BG2,,PDB (to be published),"Feb 8, 2024","Feb 8, 2024",,Read publication when released for metadata.
pT1511,Ab,SARS-CoV2_WT,,,,S; RBD,TBC,EVQLVESGGALVQPGRSLRLSCAASGFTFDDYAMHWVRQAPGKGLEWVSGIDWNSGSIGYADSVKGRFTISRDNAKNSLYLQVNSLRAEDTALYYCVKDSRAHYDILATYVGFDYWGQGTLVTVSS,DIVMTQFPLSLPVTPGEPASISCRSSQSLLHSNGNNYLDWYLQKPGQSPQLLIYLNSNRASGVPDRFSGSGSGTDFTLKISRVEAEDVGVYYCMQALQTPTFGQGTRLEIK,IGHV3-9 (Human),IGHJ4 (Human),IGKV2-28 (Human),IGKJ5 (Human),VKDSRAHYDILATYVGFDY,MQALQTPT,https://www.rcsb.org/structure/8BG1,,PDB (to be published),"Feb 8, 2024","Feb 8, 2024",,Read publication when released for metadata.
pT1375,Ab,SARS-CoV2_WT,,,,S; RBD,TBC,EVQLVESGGGLIQPGGSLRLSCAASGLIVSRNYMNWVRQAPGKGLEWVSVLYSGGSTFYADSVKGRFTISRDNSKNTLYLQMNSLRAEDTAVYFCVRDLDVKGAFDIWGQGTMVSVSS,EIVLTQSPGTLSLSPGERATLSCRASQSVSSSYLAWYQQKPGQAPRLLIYGASSRATGIPDRFSGSVSGTDFTLTISRLEPEDFAVYYCQQYGSSPITFGQGTRLEIK,IGHV3-53 (Human),IGHJ3 (Human),IGKV3-20 (Human),IGKJ5 (Human),VRDLDVKGAFDI,QQYGSSPIT,https://www.rcsb.org/structure/8BEC,,PDB (to be published),"Feb 8, 2024","Feb 8, 2024",,Read publication when released for metadata.
Liu_14B1,Ab,SARS-CoV2_WT;SARS-CoV2_Alpha;SARS-CoV2_Beta;SARS-CoV2_Gamma;SARS-CoV2_Delta;SARS-CoV2_Eta;SARS-CoV2_Omicron-BA3;SARS-CoV2_Omicron-BA2.75;SARS-CoV2_Omicron-BF7,SARS-CoV2_Omicron-XBB1.5,SARS-CoV2_WT;SARS-CoV2_Alpha;SARS-CoV2_Beta;SARS-CoV2_Gamma;SARS-CoV2_Delta;SARS-CoV2_Eta;SARS-CoV2_Omicron-BA3;SARS-CoV2_Omicron-BA2.75;SARS-CoV2_Omicron-BF7 (weak),SARS-CoV2_Omicron-BA1;SARS-CoV2_Omicron-BA2;SARS-CoV2_Omicron-BA2.12.1;SARS-CoV2_Omicron-BA4/5;SARS-CoV2_Omicron-XBB;SARS-CoV2_Omicron-XBB1.5;SARS-CoV2_Omicron-XBB1.16;SARS-CoV2_Omicron-XBB2.3.2;SARS-CoV2_Omicron-BQ1.1,S; RBD,B-cells; SARS-CoV2_WT Convalescent Patient (Unvaccinated),EVQLVESGGGVVQPGGSLRLSCVASEFTIDDYAMHWVRQTPGKGLEWVSLISGDGGRTFYADSVQGRFTISRDNSKNSLYLQMNSLRSDDIGLYYCAKGGIFYNPSRFYYPNGRLVGSAFDIWGQGTMVTVSS,EIVMTQSPATLSVSPGERATLSCRASQNISANLAWYQQKPGQAPRLLIHGASTRATGVPGRFSGSGSGTEFTLSISSLQSEDFAVYYCQHYNNWPPLTFGGGTKVEIK,IGHV3-43 (Human),IGHJ3 (Human),IGKV3-15 (Human),IGKJ4 (Human),AKGGIFYNPSRFYYPNGRLVGSAFDI,QHYNNWPPLT,https://www.rcsb.org/structure/8I3U,,"Qianqun Liu et al., 2023 (https://www.nature.com/articles/s41392-023-01615-0)","Feb 8, 2024","Feb 8, 2024",,Complete
Liu_7B3,Ab,SARS-CoV2_WT;SARS-CoV2_Alpha;SARS-CoV2_Delta;SARS-CoV2_Eta;SARS-CoV2_Omicron-BA1;SARS-CoV2_Omicron-BA2;SARS-CoV2_Omicron-BA3;SARS-CoV2_Omicron-BA2.75,,SARS-CoV2_WT;SARS-CoV2_Alpha;SARS-CoV2_Delta;SARS-CoV2_Eta;SARS-CoV2_Omicron-BA1;SARS-CoV2_Omicron-BA2;SARS-CoV2_Omicron-BA3;SARS-CoV2_Omicron-BA2.75,SARS-CoV2_Beta;SARS-CoV2_Gamma;SARS-CoV2_Eta;SARS-CoV2_Omicron-BA4/5;SARS-CoV2_Omicron-BA2.12.1;SARS-CoV2_Omicron-XBB;SARS-CoV2_Omicron-BF7;SARS-CoV2_Omicron-BQ1.1;SARS-CoV2_Omicron-XBB1.5;SARS-CoV2_Omicron-XBB1.16;SARS-CoV2_Omicron-XBB2.3.2,S; RBD,B-cells; SARS-CoV2_WT Convalescent Patient (Unvaccinated),QVQLVQSGAEMKNFGSSVKVSCKASGGTFSINWVRQAPGLGLEYMGRIIPALDRAIYTQKFQGRVTITADKSTSTVYMELSGLRSEDTAVYYCARSVVGPTPNYFDPWGQGTLVTVSS,EIVMTQSPATLSVSPGERATLSCRASQSVSSDLAWYQQKRGQAPRLLIYGASTRATGIPARFSGSGSGTEFTLTISSLQSEDFAVYYCQQYNNFIAFGQGTRLEIK,IGHV1-69 (Human),IGHJ5 (Human),IGKV3-15 (Human),IGKJ5 (Human),ARSVVGPTPNYFDP,QQYNNFIA,https://www.rcsb.org/structure/8I3S,,"Qianqun Liu et al., 2023 (https://www.nature.com/articles/s41392-023-01615-0)","Feb 8, 2024","Feb 8, 2024",,Complete
Yang_Nb015,Nb,SARS-CoV2_WT;SARS-CoV2_Alpha;SARS-CoV2_Beta;SARS-CoV2_Gamma;SARS-CoV2_Delta;SARS-CoV2_Kappa;SARS-CoV2_Lambda;SARS-CoV2_Mu;SARS-CoV2_Omicron-BA2;SARS-CoV2_Omicron-BA4/5,,SARS-CoV2_WT;SARS-CoV2_Alpha;SARS-CoV2_Beta;SARS-CoV2_Gamma;SARS-CoV2_Delta;SARS-CoV2_Kappa;SARS-CoV2_Lambda;SARS-CoV2_Mu;SARS-CoV2_Omicron-BA2;SARS-CoV2_Omicron-BA4/5,SARS-CoV2_Omicron-XBB1.5;SARS-CoV2_Omicron-XBB1.16,S; RBD,Immunised Alpaca,QLQLVESGGGWVQAGGSRRLSCAASGFTLDSYAVGWFRQAPGKEREWVSCSRSDGTTYQSDSMKGRFTISRDNTKNTVYLQMNSLKAEDTAVYYCASRRSYGCDYYGMEYWGKGTLVTVSS,,IGHV3-3 (Alpaca),IGHJ7 (Alpaca),,,ASRRSYGCDYYGMEY,,https://www.rcsb.org/structure/8H5T,,"Jing Yang et al., 2023 (https://journals.plos.org/plospathogens/article?id=10.1371/journal.ppat.1011804)","Feb 8, 2024","Feb 8, 2024",,Complete
Yang_Nb021,Nb,SARS-CoV2_WT;SARS-CoV2_Alpha;SARS-CoV2_Beta;SARS-CoV2_Gamma;SARS-CoV2_Delta;SARS-CoV2_Kappa;SARS-CoV2_Lambda;SARS-CoV2_Mu;SARS-CoV2_Omicron-BA2;SARS-CoV2_Omicron-BA4/5;SARS-CoV2_Omicron-XBB1.5 (weak);SARS-CoV2_Omicron-XBB1.16 (weak),,SARS-CoV2_WT;SARS-CoV2_Alpha;SARS-CoV2_Beta;SARS-CoV2_Gamma;SARS-CoV2_Delta;SARS-CoV2_Kappa;SARS-CoV2_Lambda;SARS-CoV2_Mu,SARS-CoV2_Omicron-BA2;SARS-CoV2_Omicron-BA4/5;SARS-CoV2_Omicron-XBB1.5;SARS-CoV2_Omicron-XBB1.16,S; RBD,Immunised Alpaca,EVQVVESGGGLVQPGGSLRLSCAASGTGSTFSTYAMGWYRQAPGNQHERVAIIDSVGNTNYPDSVKGRFTISRDNAKNTGYLQMNSLKSEDTAVYYCNLGTIWGQGTQVTVSS,,IGHV3S53 (Alpaca),IGHJ6 (Alpaca),,,NLGTI,,https://www.rcsb.org/structure/8H5U,,"Jing Yang et al., 2023 (https://journals.plos.org/plospathogens/article?id=10.1371/journal.ppat.1011804)","Feb 8, 2024","Feb 8, 2024",,Complete
DH1058,Ab,SARS-CoV2_WT,,,,S; S2 Fusion Peptide,TBC,QVQLVQSGGGVVQPGRSLRLSCAASGFNFGDFGMHWVRQAPGKGLEWVAVISYEGRNKNHADSVRGRFTISRDNSRNMLYLQMNSLRRGDTAVYYCAKENRDRNYDSWSASYSDYYYGMDVWGQGTTVTVSS,DIVMTQSPSFLSASVGDRVTITCRASQGIDRYLAWYQQKPGSAPKLLIYAASTLQSGVPSRFSGSGSETDFTLTISSLQPDDFATYYCQQLSTYPTITFGQGTRLEIK,IGHV3-30 (Human),IGHJ6 (Human),IGKV1-9 (Human),IGKJ5 (Human),AKENRDRNYDSWSASYSDYYYGMDV,QQLSTYPTIT,https://www.rcsb.org/structure/8FDO,,PDB (to be published),"Feb 8, 2024","Feb 8, 2024",,Read publication when released for metadata.
STI-9167,Ab,SARS-CoV2_WT,,,,S; RBD,TBC,QVQLVESGGGVVQPGRSLRLSCAASGFTFSSYGMNWVRQAPGKGLEWVAIIWYDGNNKYYVDSVKGRFTISRDNSKNTLYLQMNSLRAEDTAVYYCARKDYSKTYYGYYFDYWGQGTLVTVSS,DIQMTQSPSSLSASVGDRVTITCRASQSIHSFLNWYQQKPGKPPNLLIYAASSLQSGLPSRFSGSGSGTDFTLTISSLQPEDFATYYCQQSYITPPTFGHGTKVEIK,IGHV3-33 (Human),IGHJ4 (Human),IGKV1-39 (Human),IGKJ4 (Human),ARKDYSKTYYGYYFDY,QQSYITPPT,https://www.rcsb.org/structure/8EQF,,PDB (to be published),"Feb 8, 2024","Feb 8, 2024",,Read publication when released for metadata.
Ma_scFv,Ab,SARS-CoV2_WT,,,,S; RBD,Immunised Sheep,QVQLQESGPSLVKPSQTLSLTCTVSGFSITSDGVLWVRQAPGKALEWVGAIYQNGATYYNPALKSRLSITRDTSKSQVSLSLSSVTTEDTAVYYCARDTDYDGMDVWGRGLLVTVSS,QAVLTQPSSVSGSLGQSVSITCSGSSSNVGYGNYVSWFQQVPGSAPKLLIYGATSRASGVPDRFSGSRSGNTATLTISSLQAEDEADYYCASGDSGSSLVFGSGTRLTVL,IGHV1-14 (Cow),IGHJ1-6 (Cow),IGLV1-40 (Cow),IGLJ4 (Cow),ARDTDYDGMDV,ASGDSGSSLV,https://www.rcsb.org/structure/8JUH;https://www.rcsb.org/structure/8KGZ,,PDB (to be published),"Feb 8, 2024","Feb 8, 2024",,"Read publication when released for metadata. No sheep germlines, assigns closest to cow."
BA7535,Ab,SARS-CoV2_Omicron-BA2,,,,S; Unk,TBC,EVQLVESGGGVVQPGRSLRLSCAASEFTFSSFAMHWVRQAPGKGLEWVALISYDGSNKYYADSVKGRFTISRDNSKNTLYLQMNSLRAEDTAVYYCARVSYPLTKYYYGMDVWGQGTTVTVSS,EIVMTQSPAFMSATPGDKVNISCKASQDIADDMNWYQQKPGEAAIFIIQEATTLVPGISPRFSGSGYGTDFTLTINNIESEDAAYYFCLQHDNFPLTFGGGTKVEIK,IGHV3-30 (Human),IGHJ6 (Human),IGKV5-2 (Human),IGKJ4 (Human),ARVSYPLTKYYYGMDV,LQHDNFPLT,https://www.rcsb.org/structure/8H7L;https://www.rcsb.org/structure/8H7Z,,PDB (to be published),"Feb 8, 2024","Feb 8, 2024",,Read publication when released for metadata.
VacBB-665,Ab,SARS-CoV2_Omicron-BA1,,,,S; RBD,TBC,QLVQSGPEVKKPGSSVRVSCKASGFTFTPSAVQWVRQARGQRLEWIGWIVVGSGNTNYAQKFQERVTITRDMSTGTVYMDLSSLRSEDTACYYCAAPHCNRTNCYDGFDLWGQGTVVTV,EIVLTQSPGTLSLSPGERATLSCRASQSVSSSYLAWYQQKPGQAPRLLIYGASSRATGIPDRFSGTGSGTDFTLTISRLEPEDFAVYYCQQYGRSPWTFGQGTKVEI,IGHV1-58 (Human),IGHJ2 (Human),IGKV3-20 (Human),IGKJ1 (Human),AAPHCNRTNCYDGFDL,QQYGRSPWT,https://www.rcsb.org/structure/8GSB,,PDB (to be published),"Feb 8, 2024","Feb 8, 2024",,Read publication when released for metadata.